BDBM936 5PhBuCOOH deriv.::Statine deriv. 16::Tle-Val-Sta::benzyl N-[(1S)-1-{[(2S,3R,4R)-4-{[(1S)-1-(benzylcarbamoyl)-2-methylpropyl]carbamoyl}-3-hydroxy-4-{[(4-methoxyphenyl)methyl]amino}-1-phenylbutan-2-yl]carbamoyl}-2-methylpropyl]carbamate
SMILES COc1ccc(CN[C@H]([C@H](O)[C@H](Cc2ccccc2)NC(=O)[C@@H](NC(=O)OCc2ccccc2)C(C)C)C(=O)N[C@@H](C(C)C)C(=O)NCc2ccccc2)cc1
InChI Key InChIKey=PTUDGEXQSRHGJV-PLXHNDKISA-N
Data  3 KI
  Tab Delimited (TSV)   2D SDfile   Computed 3D by Vconf -m prep SDfile
Find this compound or compounds like it in BindingDB:
Activity Spreadsheet -- Enzyme Inhibition Constant Data from BindingDB
Found 1 hit for monomerid = 936
TargetDimer of Gag-Pol polyprotein [514-612](Human immunodeficiency virus type 2)
Sandoz Forschungsinstitut Ges.M.B.H.
LigandPNGBDBM936(5PhBuCOOH deriv. | Statine deriv. 16 | Tle-Val-Sta...)
Affinity DataKi:  39nM ΔG°:  -10.5kcal/molepH: 4.7 T: 2°C. Assay description: Enzymatic activity was measured by following cleavage of the substrate H-Lys-Ala-Arg-Val-Leu-pNph-Glu-Ala-Nle-NH2. Products of the cleavage reaction ...
In DepthDetails ArticlePubMed